Target
Cathepsin D
Ligand
BDBM50383846
Substrate
Meas. Tech.
ChEMBL_819410 (CHEMBL2033077)
IC50
4±n/a nM
Citation
 Monenschein, HHorne, DBBartberger, MDHitchcock, SANguyen, TTPatel, VFPennington, LDZhong, W Structure guided P1' modifications of HEA derivedß-secretase inhibitors for the treatment of Alzheimer's disease. Bioorg Med Chem Lett 22:3607-11 (2012)  
Target
Name:
Cathepsin D
Synonyms:
CATD_HUMAN CTSD Cathepsin D heavy chain Cathepsin D precursor
Type:
Enzyme
Mol. Mass.:
44551.72
Organism:
Homo sapiens (Human)
Description:
Human proCathepsin D (SwissProt accession number P07339) was expressed in Sf9 cells, purified, and autoactivated.
Residue:
412
  
Inhibitor
Name:
BDBM50383846
Synonyms:
CHEMBL2031142
Type:
Small organic molecule
Emp. Form.:
C29H39F2N3O3
Mol. Mass.:
515.6351
SMILES:
C[C@H]1C[C@]2(C1)C[C@H](NC[C@@H](O)[C@H](Cc1ccc(F)c(F)c1)NC(C)=O)c1cc(CC(C)(C)C)cnc1O2
: