Target
Kappa-type opioid receptor
Ligand
BDBM50384054
Substrate
Meas. Tech.
ChEMBL_819786 (CHEMBL2034298)
EC50
0.22±n/a nM
Citation
 Roberts, LRBrady, KBrown, ADavey, DFeng, LHuang, HLiu, DMalet, LMcMurray, GPhelan, ASaunders, KBhat, A Kappa agonist CovX-Bodies. Bioorg Med Chem Lett 22:4173-8 (2012)  
Target
Name:
Kappa-type opioid receptor
Synonyms:
Kappa Opioid Receptor OPRK1 Opiate Kappa 1 | mu/kappa opioid receptor
Type:
G Protein-Coupled Receptor (GPCR)
Mol. Mass.:
42744.99
Organism:
Cavia porcellus (domestic guinea pig)
Description:
P41144
Residue:
380
  
Inhibitor
Name:
BDBM50384054
Synonyms:
CHEMBL2032447
Type:
Small organic molecule
Emp. Form.:
C30H44N6O4
Mol. Mass.:
552.7082
SMILES:
CC(C)C[C@@H](NC(=O)[C@@H](Cc1ccccc1)NC(=O)[C@H](N)Cc1ccccc1)C(=O)N[C@H](CCCCN)C(N)=O
: