Target
3-phosphoinositide-dependent protein kinase 1
Ligand
BDBM50384069
Substrate
Meas. Tech.
ChEMBL_819787 (CHEMBL2034299)
IC50
461000±n/a nM
Citation
 Lee, ACRamanujulu, PMPoulsen, AWilliams, MBlanchard, SMa, DMBonday, ZGoh, KLGoh, KCGoh, MKWood, JDymock, BW Thieno[3,2-d]pyrimidin-4(3H)-one derivatives as PDK1 inhibitors discovered by fragment-based screening. Bioorg Med Chem Lett 22:4023-7 (2012)  
Target
Name:
3-phosphoinositide-dependent protein kinase 1
Synonyms:
3-Phosphoinositide-Dependent Protein Kinase 1 (PDK1) 3-phosphoinositide-dependent protein kinase 1 3-phosphoinositide-dependent protein kinase 1 (PDK-1) Isoform 2 of 3-phosphoinositide-dependent protein kinase 1 PDPK1 Phosphoinositide-dependent protein kinase 1 (PDK1) hPDK1
Type:
Enzyme
Mol. Mass.:
63157.65
Organism:
Homo sapiens (Human)
Description:
O15530
Residue:
556
  
Inhibitor
Name:
BDBM50384069
Synonyms:
CHEMBL1877245
Type:
Small organic molecule
Emp. Form.:
C7H6N2OS
Mol. Mass.:
166.2
SMILES:
Cc1csc2c1nc[nH]c2=O
: