Target
Prostaglandin G/H synthase 1
Ligand
BDBM50207446
Substrate
Meas. Tech.
ChEMBL_821152 (CHEMBL2039694)
IC50
7±n/a nM
Citation
 Stumpfe, DBajorath, J Exploring activity cliffs in medicinal chemistry. J Med Chem 55:2932-42 (2012)  
Target
Name:
Prostaglandin G/H synthase 1
Synonyms:
COX-1 Cyclooxygenase Cyclooxygenase-1 (COX-1) PTGS1 | Prostaglandin G/H synthase (cyclooxygenase)
Type:
Enzyme
Mol. Mass.:
68692.62
Organism:
Homo sapiens (Human)
Description:
P23219
Residue:
599
  
Inhibitor
Name:
BDBM50207446
Synonyms:
2-(2-(2-chloro-6-fluorophenylamino)-5-methylphenyl)acetic acid | CHEMBL404108
Type:
Small organic molecule
Emp. Form.:
C15H13ClFNO2
Mol. Mass.:
293.721
SMILES:
Cc1ccc(Nc2c(F)cccc2Cl)c(CC(O)=O)c1
: