Target
D(4) dopamine receptor
Ligand
BDBM50384960
Substrate
Meas. Tech.
ChEMBL_820695 (CHEMBL2037966)
Ki
51.5±n/a nM
Citation
 Zhu, XYEtukala, JREyunni, SVSetola, VRoth, BLAblordeppey, SY Benzothiazoles as probes for the 5HT1A receptor and the serotonin transporter (SERT): a search for new dual-acting agents as potential antidepressants. Eur J Med Chem 53:124-32 (2012)  
Target
Name:
D(4) dopamine receptor
Synonyms:
D(4) dopamine receptor DOPAMINE D4.4 Dopamine receptor | Drd4
Type:
Enzyme Catalytic Domain
Mol. Mass.:
41307.65
Organism:
RAT
Description:
DOPAMINE D4.4 0 RAT::P30729
Residue:
387
  
Inhibitor
Name:
BDBM50384960
Synonyms:
CHEMBL2037519
Type:
Small organic molecule
Emp. Form.:
C19H21N5OS
Mol. Mass.:
367.468
SMILES:
O=C(CCCN1CCN(CC1)c1ncccn1)c1nc2ccccc2s1
: