Target
11-beta-hydroxysteroid dehydrogenase 1
Ligand
BDBM50385051
Substrate
Meas. Tech.
ChEMBL_821475 (CHEMBL2038005)
IC50
3.3±n/a nM
Citation
 Rew, YDeGraffenreid, MHe, XJaen, JCMcMinn, DLSun, DTu, HUrsu, SPowers, JP Discovery and optimization of benzenesulfonanilide derivatives as a novel class of 11ß-HSD1 inhibitors. Bioorg Med Chem Lett 22:3786-90 (2012)  
Target
Name:
11-beta-hydroxysteroid dehydrogenase 1
Synonyms:
11-DH 11-beta-Hydroxysteroid Dehydrogenase 1 (11-beta-HSD1) 11-beta-hydroxysteroid dehydrogenase 1 (11HSD1) Corticosteroid 11-beta-dehydrogenase isozyme 1 (11-beta-HSD-1) Corticosteroid 11-beta-dehydrogenase isozyme 1 (11beta-HSD1) HSD11 HSD11L | SDR26C1
Type:
Enzyme
Mol. Mass.:
32409.16
Organism:
Homo sapiens (Human)
Description:
P28845
Residue:
292
  
Inhibitor
Name:
BDBM50385051
Synonyms:
CHEMBL2035418
Type:
Small organic molecule
Emp. Form.:
C18H18BrClF3NO3S
Mol. Mass.:
500.758
SMILES:
CC(C)N(c1ccc(cc1)C(C)(O)C(F)(F)F)S(=O)(=O)c1cc(Br)ccc1Cl
: