Target
Glutamate receptor ionotropic, NMDA 2B
Ligand
BDBM50385168
Substrate
Meas. Tech.
ChEMBL_822076 (CHEMBL2040391)
Kd
3.2±n/a nM
Citation
 Koudih, RGilbert, GDhilly, MAbbas, ABarré, LDebruyne, DSobrio, F Synthesis and in vitro characterization of trans- and cis-[(18)F]-4-methylbenzyl 4-[(pyrimidin-2-ylamino)methyl]-3-fluoropiperidine-1-carboxylates as new potential PET radiotracer candidates for the NR2B subtype N-methyl-D-aspartate receptor. Eur J Med Chem 53:408-15 (2012)  
Target
Name:
Glutamate receptor ionotropic, NMDA 2B
Synonyms:
GluN2B Grin2b NMDA receptor subunit N2B (GluN2B) NMDE2_RAT | NR2B
Type:
Protein
Mol. Mass.:
166077.66
Organism:
Rattus norvegicus (Rat)
Description:
Q00960
Residue:
1482
  
Inhibitor
Name:
BDBM50385168
Synonyms:
CHEMBL2036514
Type:
Small organic molecule
Emp. Form.:
C19H23FN4O2
Mol. Mass.:
358.4099
SMILES:
Cc1ccc(COC(=O)N2CC[C@@H](CNc3ncccn3)[C@H](F)C2)cc1
: