Target
Peroxisome proliferator-activated receptor alpha
Ligand
BDBM50157058
Substrate
Meas. Tech.
ChEMBL_822292 (CHEMBL2038446)
IC50
1348.96±n/a nM
Citation
 Méndez-Lucio, OPérez-Villanueva, JCastillo, RMedina-Franco, JL Activity landscape modeling of PPAR ligands with dual-activity difference maps. Bioorg Med Chem 20:3523-32 (2012)  
Target
Name:
Peroxisome proliferator-activated receptor alpha
Synonyms:
NR1C1 PPAR PPAR-alpha PPARA_HUMAN Peroxisome proliferator-activated receptor | Peroxisome proliferator-activated receptor alpha (PPAR alpha)
Type:
Enzyme
Mol. Mass.:
52222.08
Organism:
Homo sapiens (Human)
Description:
Q07869
Residue:
468
  
Inhibitor
Name:
BDBM50157058
Synonyms:
(S)-2-Methoxy-3-{3-methoxy-4-[3-(4-phenoxy-phenoxy)-propoxy]-phenyl}-propionic acid | CHEMBL180504
Type:
Small organic molecule
Emp. Form.:
C26H28O7
Mol. Mass.:
452.4963
SMILES:
CO[C@@H](Cc1ccc(OCCCOc2ccc(Oc3ccccc3)cc2)c(OC)c1)C(O)=O
: