Target
Peroxisome proliferator-activated receptor gamma
Ligand
BDBM50135780
Substrate
Meas. Tech.
ChEMBL_822294 (CHEMBL2038597)
IC50
6501.3±n/a nM
Citation
 Méndez-Lucio, OPérez-Villanueva, JCastillo, RMedina-Franco, JL Activity landscape modeling of PPAR ligands with dual-activity difference maps. Bioorg Med Chem 20:3523-32 (2012)  
Target
Name:
Peroxisome proliferator-activated receptor gamma
Synonyms:
NR1C3 PPAR-gamma PPARG_HUMAN Peroxisome proliferator-activated receptor gamma (PPAR gamma) Peroxisome proliferator-activated receptor gamma (PPARĪ³) peroxisome proliferator-activated receptor gamma isoform 2
Type:
Nuclear Receptor
Mol. Mass.:
57613.46
Organism:
Homo sapiens (Human)
Description:
P37231
Residue:
505
  
Inhibitor
Name:
BDBM50135780
Synonyms:
2-Methyl-2-(4-{3-[1-(4-methyl-benzyl)-5-oxo-4,5-dihydro-1H-[1,2,4]triazol-3-yl]-propyl}-phenoxy)-propionic acid | CHEMBL424133
Type:
Small organic molecule
Emp. Form.:
C23H27N3O4
Mol. Mass.:
409.4782
SMILES:
Cc1ccc(Cn2nc(CCCc3ccc(OC(C)(C)C(O)=O)cc3)[nH]c2=O)cc1
: