Target
Peroxisome proliferator-activated receptor gamma
Ligand
BDBM50135773
Substrate
Meas. Tech.
ChEMBL_822294 (CHEMBL2038597)
IC50
1698.24±n/a nM
Citation
 Méndez-Lucio, OPérez-Villanueva, JCastillo, RMedina-Franco, JL Activity landscape modeling of PPAR ligands with dual-activity difference maps. Bioorg Med Chem 20:3523-32 (2012)  
Target
Name:
Peroxisome proliferator-activated receptor gamma
Synonyms:
NR1C3 PPAR-gamma PPARG_HUMAN Peroxisome proliferator-activated receptor gamma (PPAR gamma) Peroxisome proliferator-activated receptor gamma (PPARĪ³) peroxisome proliferator-activated receptor gamma isoform 2
Type:
Nuclear Receptor
Mol. Mass.:
57613.46
Organism:
Homo sapiens (Human)
Description:
P37231
Residue:
505
  
Inhibitor
Name:
BDBM50135773
Synonyms:
2-(4-{3-[1-(3,4-Dimethyl-benzyl)-4-methyl-5-oxo-4,5-dihydro-1H-[1,2,4]triazol-3-yl]-propyl}-phenoxy)-2-methyl-propionic acid | CHEMBL344282
Type:
Small organic molecule
Emp. Form.:
C25H31N3O4
Mol. Mass.:
437.5313
SMILES:
Cc1ccc(Cn2nc(CCCc3ccc(OC(C)(C)C(O)=O)cc3)n(C)c2=O)cc1C
: