Target
Peroxisome proliferator-activated receptor delta
Ligand
BDBM50227763
Substrate
Meas. Tech.
ChEMBL_822293 (CHEMBL2038596)
IC50
5±n/a nM
Citation
 Méndez-Lucio, OPérez-Villanueva, JCastillo, RMedina-Franco, JL Activity landscape modeling of PPAR ligands with dual-activity difference maps. Bioorg Med Chem 20:3523-32 (2012)  
Target
Name:
Peroxisome proliferator-activated receptor delta
Synonyms:
NR1C2 NUCI Nuclear receptor subfamily 1 group C member 2 PPAR-beta PPARD Peroxisome proliferator-activated receptor Peroxisome proliferator-activated receptor delta
Type:
Enzyme
Mol. Mass.:
49910.45
Organism:
Homo sapiens (Human)
Description:
Q03181
Residue:
441
  
Inhibitor
Name:
BDBM50227763
Synonyms:
(R)-3-(4-(3-(1-(5-chloro-1,3-dimethyl-1H-indole-2-carboxamido)ethyl)-5-fluorophenoxy)-2-ethylphenyl)propanoic acid | CHEMBL238357
Type:
Small organic molecule
Emp. Form.:
C30H30ClFN2O4
Mol. Mass.:
537.022
SMILES:
CCc1cc(Oc2cc(F)cc(c2)[C@@H](C)NC(=O)c2c(C)c3cc(Cl)ccc3n2C)ccc1CCC(O)=O
: