Target
Peroxisome proliferator-activated receptor gamma
Ligand
BDBM50184249
Substrate
Meas. Tech.
ChEMBL_822294 (CHEMBL2038597)
IC50
1199.5±n/a nM
Citation
 Méndez-Lucio, OPérez-Villanueva, JCastillo, RMedina-Franco, JL Activity landscape modeling of PPAR ligands with dual-activity difference maps. Bioorg Med Chem 20:3523-32 (2012)  
Target
Name:
Peroxisome proliferator-activated receptor gamma
Synonyms:
NR1C3 PPAR-gamma PPARG_HUMAN Peroxisome proliferator-activated receptor gamma (PPAR gamma) Peroxisome proliferator-activated receptor gamma (PPARĪ³) peroxisome proliferator-activated receptor gamma isoform 2
Type:
Nuclear Receptor
Mol. Mass.:
57613.46
Organism:
Homo sapiens (Human)
Description:
P37231
Residue:
505
  
Inhibitor
Name:
BDBM50184249
Synonyms:
3-(1-(3-(7-propyl-3-(trifluoromethyl)benzo[d]isoxazol-6-yloxy)propyl)-1H-indol-5-yl)propanoic acid | CHEMBL207907
Type:
Small organic molecule
Emp. Form.:
C25H25F3N2O4
Mol. Mass.:
474.4722
SMILES:
CCCc1c(OCCCn2ccc3cc(CCC(O)=O)ccc23)ccc2c(noc12)C(F)(F)F
: