Target
Peroxisome proliferator-activated receptor alpha
Ligand
BDBM50184249
Substrate
Meas. Tech.
ChEMBL_822292 (CHEMBL2038446)
IC50
449.78±n/a nM
Citation
 Méndez-Lucio, OPérez-Villanueva, JCastillo, RMedina-Franco, JL Activity landscape modeling of PPAR ligands with dual-activity difference maps. Bioorg Med Chem 20:3523-32 (2012)  
Target
Name:
Peroxisome proliferator-activated receptor alpha
Synonyms:
NR1C1 PPAR PPAR-alpha PPARA_HUMAN Peroxisome proliferator-activated receptor | Peroxisome proliferator-activated receptor alpha (PPAR alpha)
Type:
Enzyme
Mol. Mass.:
52222.08
Organism:
Homo sapiens (Human)
Description:
Q07869
Residue:
468
  
Inhibitor
Name:
BDBM50184249
Synonyms:
3-(1-(3-(7-propyl-3-(trifluoromethyl)benzo[d]isoxazol-6-yloxy)propyl)-1H-indol-5-yl)propanoic acid | CHEMBL207907
Type:
Small organic molecule
Emp. Form.:
C25H25F3N2O4
Mol. Mass.:
474.4722
SMILES:
CCCc1c(OCCCn2ccc3cc(CCC(O)=O)ccc23)ccc2c(noc12)C(F)(F)F
: