Target
Neuronal acetylcholine receptor subunit alpha-7
Ligand
BDBM50385392
Substrate
Meas. Tech.
ChEMBL_822859 (CHEMBL2037891)
Ki
0.6±n/a nM
Citation
 Gao, YRavert, HTValentine, HScheffel, UFinley, PWong, DFDannals, RFHorti, AG 5-(5-(6-[(11)C]methyl-3,6-diazabicyclo[3.2.0]heptan-3-yl)pyridin-2-yl)-1H-indole as a potential PET radioligand for imaging cerebrala7-nAChR in mice. Bioorg Med Chem 20:3698-702 (2012)  
Target
Name:
Neuronal acetylcholine receptor subunit alpha-7
Synonyms:
ACHA7_RAT Cholinergic, Nicotinic Alpha7 Chrna7 Neuronal acetylcholine receptor (alpha7 nAChR) Neuronal acetylcholine receptor subunit alpha-7 Neuronal acetylcholine receptor subunit alpha-7 (nAChR)
Type:
Enzyme
Mol. Mass.:
56502.44
Organism:
Rattus norvegicus (Rat)
Description:
Q05941
Residue:
502
  
Inhibitor
Name:
BDBM50385392
Synonyms:
CHEMBL2036416
Type:
Small organic molecule
Emp. Form.:
C19H20N4
Mol. Mass.:
304.3889
SMILES:
CN1C[C@H]2CN(C[C@@H]12)c1ccc(nc1)-c1ccc2[nH]ccc2c1
: