Target
Potassium voltage-gated channel subfamily H member 2
Ligand
BDBM50385393
Substrate
Meas. Tech.
ChEMBL_822867 (CHEMBL2037899)
Ki
1900±n/a nM
Citation
 Gao, YRavert, HTValentine, HScheffel, UFinley, PWong, DFDannals, RFHorti, AG 5-(5-(6-[(11)C]methyl-3,6-diazabicyclo[3.2.0]heptan-3-yl)pyridin-2-yl)-1H-indole as a potential PET radioligand for imaging cerebrala7-nAChR in mice. Bioorg Med Chem 20:3698-702 (2012)  
Target
Name:
Potassium voltage-gated channel subfamily H member 2
Synonyms:
1,3-beta-glucan synthase component GLS2 ERG Eag-related protein 1 Ether-a-go-go-related gene (HERG) Ether-a-go-go-related gene potassium channel 1 Ether-a-go-go-related gene potassium channel 1 (hERG1) Ether-a-go-go-related protein 1 H-ERG KCNH2 Potassium voltage-gated channel subfamily H member 2 (hERG) Voltage-gated potassium channel subunit Kv11.1 hERG Potassium Channel 1 | putative potassium channel subunit
Type:
Multi-pass membrane protein
Mol. Mass.:
126672.65
Organism:
Homo sapiens (Human)
Description:
Q12809
Residue:
1159
  
Inhibitor
Name:
BDBM50385393
Synonyms:
CHEMBL2036415
Type:
Small organic molecule
Emp. Form.:
C19H20N4
Mol. Mass.:
304.3889
SMILES:
CN1C[C@@H]2CN(C[C@H]12)c1ccc(nc1)-c1ccc2[nH]ccc2c1
: