Target
Diacylglycerol O-acyltransferase 1
Ligand
BDBM50385398
Substrate
Meas. Tech.
ChEMBL_822968 (CHEMBL2038289)
IC50
1.1±n/a nM
Citation
 McCoull, WAddie, MSBirch, AMBirtles, SBuckett, LKButlin, RJBowker, SSBoyd, SChapman, SDavies, RDDonald, CSGreen, CPJenner, CKemmitt, PDLeach, AGMoody, GCGutierrez, PMNewcombe, NJNowak, TPacker, MJPlowright, ATRevill, JSchofield, PSheldon, CStokes, STurnbull, AVWang, SJWhalley, DPWood, JM Identification, optimisation and in vivo evaluation of oxadiazole DGAT-1 inhibitors for the treatment of obesity and diabetes. Bioorg Med Chem Lett 22:3873-8 (2012)  
Target
Name:
Diacylglycerol O-acyltransferase 1
Synonyms:
DGAT1_MOUSE Dgat1 Diacylglycerol O-acyltransferase 1 (DGAT1) | Diglyceride acyltransferase
Type:
Enzyme
Mol. Mass.:
56810.61
Organism:
Mus musculus (mouse)
Description:
In this assay, recombinant mouse DGAT-1 containing an N-terminal His6-epitope tag was produced in the baculovirus expression system.
Residue:
498
  
Inhibitor
Name:
BDBM50385398
Synonyms:
CHEMBL2036730
Type:
Small organic molecule
Emp. Form.:
C23H22F2N4O4
Mol. Mass.:
456.442
SMILES:
OC(=O)C[C@H]1CC[C@@H](CC1)c1ccc(NC(=O)c2nnc(Nc3ccc(F)c(F)c3)o2)cc1
: