Target
Insulin receptor
Ligand
BDBM50385597
Substrate
Meas. Tech.
ChEMBL_825876 (CHEMBL2044753)
IC50
215±n/a nM
Citation
 Ott, GRTripathy, RCheng, MMcHugh, RAnzalone, AVUnderiner, TLCurry, MAQuail, MRLu, LWan, WAngeles, TSAlbom, MSAimone, LDAtor, MARuggeri, BADorsey, BD Discovery of a potent inhibitor of anaplastic lymphoma kinase with in vivo antitumor activity. ACS Med Chem Lett 1:493-498 (2010)  
Target
Name:
Insulin receptor
Synonyms:
INSR INSR_HUMAN Insulin receptor beta subunit
Type:
Receptor Tyrosine Kinase
Mol. Mass.:
156322.60
Organism:
Homo sapiens (Human)
Description:
P06213
Residue:
1382
  
Inhibitor
Name:
BDBM50385597
Synonyms:
CHEMBL2042827
Type:
Small organic molecule
Emp. Form.:
C25H27ClN6O3
Mol. Mass.:
494.973
SMILES:
CCN1c2ccc(Nc3ncc(Cl)c(Nc4ccccc4C(=O)NC)n3)c(OC)c2CCCC1=O
: