Target
Heat shock protein HSP 90-beta
Ligand
BDBM50386018
Substrate
Meas. Tech.
ChEMBL_825804 (CHEMBL2044533)
IC50
330±n/a nM
Citation
 Buchstaller, HPEggenweiler, HMSirrenberg, CGrädler, UMusil, DHoppe, EZimmermann, ASchwartz, HMärz, JBomke, JWegener, AWolf, M Fragment-based discovery of hydroxy-indazole-carboxamides as novel small molecule inhibitors of Hsp90. Bioorg Med Chem Lett 22:4396-403 (2012)  
Target
Name:
Heat shock protein HSP 90-beta
Synonyms:
HS90B_HUMAN HSP 90 HSP90B HSPCB Heat shock protein HSP 90 (Hsp90)
Type:
Molecular Chaperone
Mol. Mass.:
83229.45
Organism:
Homo sapiens (Human)
Description:
P08238
Residue:
724
  
Inhibitor
Name:
BDBM50386018
Synonyms:
CHEMBL2042857
Type:
Small organic molecule
Emp. Form.:
C23H20ClN3O2
Mol. Mass.:
405.877
SMILES:
CN(Cc1ccc(Cl)cc1)C(=O)c1cc2c(Cc3ccccc3)n[nH]c2cc1O
: