Target
Glycogen phosphorylase, muscle form
Ligand
BDBM50386287
Substrate
Meas. Tech.
ChEMBL_824545 (CHEMBL2045428)
Ki
33400±n/a nM
Citation
 Kantsadi, ALManta, SPsarra, AMDimopoulou, AKiritsis, CParmenopoulou, VSkamnaki, VTZoumpoulakis, PZographos, SELeonidas, DDKomiotis, D The binding of C5-alkynyl and alkylfurano[2,3-d]pyrimidine glucopyranonucleosides to glycogen phosphorylase b: synthesis, biochemical and biological assessment. Eur J Med Chem 54:740-9 (2012)  
Target
Name:
Glycogen phosphorylase, muscle form
Synonyms:
Glycogen Phosphorylase (PYGM) Glycogen phosphorylase, muscle form PYGM | PYGM_RABIT
Type:
Enzyme
Mol. Mass.:
97296.32
Organism:
Oryctolagus cuniculus (rabbit)
Description:
Phosphorylation of Ser-15 converts phosphorylase B (unphosphorylated) to phosphorylase A.
Residue:
843
  
Inhibitor
Name:
BDBM50386287
Synonyms:
CHEMBL2041080
Type:
Small organic molecule
Emp. Form.:
C17H24N2O7
Mol. Mass.:
368.3817
SMILES:
CCCCCc1cc2cn([C@@H]3O[C@H](CO)[C@@H](O)[C@H](O)[C@H]3O)c(=O)nc2o1
: