Target
Glycogen phosphorylase, muscle form
Ligand
BDBM50351158
Substrate
Meas. Tech.
ChEMBL_824545 (CHEMBL2045428)
Ki
1700000±n/a nM
Citation
 Kantsadi, ALManta, SPsarra, AMDimopoulou, AKiritsis, CParmenopoulou, VSkamnaki, VTZoumpoulakis, PZographos, SELeonidas, DDKomiotis, D The binding of C5-alkynyl and alkylfurano[2,3-d]pyrimidine glucopyranonucleosides to glycogen phosphorylase b: synthesis, biochemical and biological assessment. Eur J Med Chem 54:740-9 (2012)  
Target
Name:
Glycogen phosphorylase, muscle form
Synonyms:
Glycogen Phosphorylase (PYGM) Glycogen phosphorylase, muscle form PYGM | PYGM_RABIT
Type:
Enzyme
Mol. Mass.:
97296.32
Organism:
Oryctolagus cuniculus (rabbit)
Description:
Phosphorylation of Ser-15 converts phosphorylase B (unphosphorylated) to phosphorylase A.
Residue:
843
  
Inhibitor
Name:
BDBM50351158
Synonyms:
CHEMBL423707
Type:
Small organic molecule
Emp. Form.:
C6H12O6
Mol. Mass.:
180.1559
SMILES:
OC[C@H]1O[C@H](O)[C@H](O)[C@@H](O)[C@@H]1O
: