Target
Amine oxidase [flavin-containing] A
Ligand
BDBM50386544
Substrate
Meas. Tech.
ChEMBL_826182 (CHEMBL2049623)
Ki
371.54±n/a nM
Citation
 Pettersson, FSvensson, PWaters, SWaters, NSonesson, C Synthesis and evaluation of a set of para-substituted 4-phenylpiperidines and 4-phenylpiperazines as monoamine oxidase (MAO) inhibitors. J Med Chem 55:3242-9 (2012)  
Target
Name:
Amine oxidase [flavin-containing] A
Synonyms:
AOFA_RAT Amine oxidase [flavin-containing] A Monoamine Oxidase Type A (MAO-A) Monoamine oxidase A (MAO-A) Monoamine oxidase type A (MAOA)
Type:
Enzyme
Mol. Mass.:
59515.21
Organism:
Rattus norvegicus (rat)
Description:
Residue:
526
  
Inhibitor
Name:
BDBM50386544
Synonyms:
CHEMBL2048231
Type:
Small organic molecule
Emp. Form.:
C18H29NO
Mol. Mass.:
275.429
SMILES:
CCCCOc1ccc(cc1)C1CCN(CCC)CC1
: