Target
Amine oxidase [flavin-containing] B
Ligand
BDBM50386545
Substrate
Meas. Tech.
ChEMBL_826183 (CHEMBL2049624)
Ki
588843.66±n/a nM
Citation
 Pettersson, FSvensson, PWaters, SWaters, NSonesson, C Synthesis and evaluation of a set of para-substituted 4-phenylpiperidines and 4-phenylpiperazines as monoamine oxidase (MAO) inhibitors. J Med Chem 55:3242-9 (2012)  
Target
Name:
Amine oxidase [flavin-containing] B
Synonyms:
AOFB_RAT Amine oxidase [flavin-containing] B Monoamine Oxidase Type B (MAO-B) Monoamine oxidase B (MAO-B) Monoamine oxidase type B (MAOB) | Monoamine oxidase-B (MAO-B)
Type:
Enzyme
Mol. Mass.:
58469.65
Organism:
Rattus norvegicus (rat)
Description:
P19643
Residue:
520
  
Inhibitor
Name:
BDBM50386545
Synonyms:
CHEMBL2048232
Type:
Small organic molecule
Emp. Form.:
C15H20N2
Mol. Mass.:
228.3327
SMILES:
CCCN1CCC(CC1)c1ccc(cc1)C#N
: