Target
Free fatty acid receptor 1
Ligand
BDBM50386651
Substrate
Meas. Tech.
ChEMBL_826835 (CHEMBL2051552)
Ki
18±n/a nM
Citation
 Mikami, SKitamura, SNegoro, NSasaki, SSuzuki, MTsujihata, YMiyazaki, TIto, RSuzuki, NMiyazaki, JSantou, TKanzaki, NFunami, MTanaka, TYasuma, TMomose, Y Discovery of phenylpropanoic acid derivatives containing polar functionalities as potent and orally bioavailable G protein-coupled receptor 40 agonists for the treatment of type 2 diabetes. J Med Chem 55:3756-76 (2012)  
Target
Name:
Free fatty acid receptor 1
Synonyms:
FFAR1 G-protein Coupled Receptor 40 | GPR40
Type:
G Protein-Coupled Receptor (GPCR)
Mol. Mass.:
31473.32
Organism:
Homo sapiens (Human)
Description:
O14842
Residue:
300
  
Inhibitor
Name:
BDBM50386651
Synonyms:
CHEMBL2048628
Type:
Small organic molecule
Emp. Form.:
C28H32FNO4
Mol. Mass.:
465.5564
SMILES:
CCOCCOc1cc(C)c(c(C)c1)-c1cccc(CNc2ccc(CCC(O)=O)c(F)c2)c1
: