Target
Free fatty acid receptor 1
Ligand
BDBM50386786
Substrate
Meas. Tech.
ChEMBL_827107 (CHEMBL2050357)
Ki
270±n/a nM
Citation
 Negoro, NSasaki, SMikami, SIto, MTsujihata, YIto, RSuzuki, MTakeuchi, KSuzuki, NMiyazaki, JSantou, TOdani, TKanzaki, NFunami, MMorohashi, ANonaka, MMatsunaga, SYasuma, TMomose, Y Optimization of (2,3-dihydro-1-benzofuran-3-yl)acetic acids: discovery of a non-free fatty acid-like, highly bioavailable G protein-coupled receptor 40/free fatty acid receptor 1 agonist as a glucose-dependent insulinotropic agent. J Med Chem 55:3960-74 (2012)  
Target
Name:
Free fatty acid receptor 1
Synonyms:
FFAR1 G-protein Coupled Receptor 40 | GPR40
Type:
G Protein-Coupled Receptor (GPCR)
Mol. Mass.:
31473.32
Organism:
Homo sapiens (Human)
Description:
O14842
Residue:
300
  
Inhibitor
Name:
BDBM50386786
Synonyms:
CHEMBL2047153
Type:
Small organic molecule
Emp. Form.:
C30H32O6
Mol. Mass.:
488.5715
SMILES:
Cc1cc(OCC2(C)COC2)cc(C)c1-c1cccc(COc2ccc3[C@@H](CC(O)=O)COc3c2)c1
: