Target
Sodium-dependent serotonin transporter
Ligand
BDBM84745
Substrate
Ki
4.6±n/a nM
Comments
PDSP_2397
Citation
 Wong, DTBymaster, FPMayle, DAReid, LRKrushinski, JHRobertson, DW LY248686, a new inhibitor of serotonin and norepinephrine uptake. Neuropsychopharmacology 8:23-33 (1993)  
Target
Name:
Sodium-dependent serotonin transporter
Synonyms:
5-HT Transporter 5HT transporter Anandamid membrane transporter, AMT Monoamine transporters; Norepinephrine & serotonin Slc6a4 Sodium-dependent serotonin transporter (SERT) | imipramine receptor
Type:
Multi-pass membrane protein
Mol. Mass.:
70168.43
Organism:
Rattus norvegicus (rat)
Description:
P31652
Residue:
630
  
Inhibitor
Name:
BDBM84745
Synonyms:
CAS_136434-34-9 LY-248686 USRE49340, Rank 5
Type:
Small organic molecule
Emp. Form.:
C18H19NOS
Mol. Mass.:
297.415
SMILES:
CNCC[C@H](Oc1cccc2ccccc12)c1cccs1
: