Target
Subtilisin-like protease 1
Ligand
BDBM50388061
Substrate
Meas. Tech.
ChEMBL_830092 (CHEMBL2061883)
IC50
40000±n/a nM
Citation
 Gemma, SGiovani, SBrindisi, MTripaldi, PBrogi, SSavini, LFiorini, INovellino, EButini, SCampiani, GPenzo, MBlackman, MJ Quinolylhydrazones as novel inhibitors of Plasmodium falciparum serine protease PfSUB1. Bioorg Med Chem Lett 22:5317-21 (2012)  
Target
Name:
Subtilisin-like protease 1
Synonyms:
SUB1 Subtilisin-like protease sub-1
Type:
PROTEIN
Mol. Mass.:
77866.88
Organism:
Plasmodium falciparum
Description:
ChEMBL_830092
Residue:
690
  
Inhibitor
Name:
BDBM50388061
Synonyms:
CHEMBL2057540
Type:
Small organic molecule
Emp. Form.:
C18H14N4O4
Mol. Mass.:
350.3282
SMILES:
Cc1cc(N=NCc2ccccc2[N+]([O-])=O)c2cc3OCOc3cc2n1
: