Target
Subtilisin-like protease 1
Ligand
BDBM50388064
Substrate
Meas. Tech.
ChEMBL_830092 (CHEMBL2061883)
IC50
20000±n/a nM
Citation
 Gemma, SGiovani, SBrindisi, MTripaldi, PBrogi, SSavini, LFiorini, INovellino, EButini, SCampiani, GPenzo, MBlackman, MJ Quinolylhydrazones as novel inhibitors of Plasmodium falciparum serine protease PfSUB1. Bioorg Med Chem Lett 22:5317-21 (2012)  
Target
Name:
Subtilisin-like protease 1
Synonyms:
SUB1 Subtilisin-like protease sub-1
Type:
PROTEIN
Mol. Mass.:
77866.88
Organism:
Plasmodium falciparum
Description:
ChEMBL_830092
Residue:
690
  
Inhibitor
Name:
BDBM50388064
Synonyms:
CHEMBL1237284 | TCMDC-123970
Type:
Small organic molecule
Emp. Form.:
C18H16N4O3
Mol. Mass.:
336.3446
SMILES:
COc1ccc2nc(C)cc(N=NCc3ccc(cc3)[N+]([O-])=O)c2c1
: