Target
Dipeptidyl peptidase 4
Ligand
BDBM50388124
Substrate
Meas. Tech.
ChEMBL_829356 (CHEMBL2060147)
IC50
1.5±n/a nM
Citation
 Yoshida, TAkahoshi, FSakashita, HSonda, STakeuchi, MTanaka, YNabeno, MKishida, HMiyaguchi, IHayashi, Y Fused bicyclic heteroarylpiperazine-substituted L-prolylthiazolidines as highly potent DPP-4 inhibitors lacking the electrophilic nitrile group. Bioorg Med Chem 20:5033-41 (2012)  
Target
Name:
Dipeptidyl peptidase 4
Synonyms:
Bile canaliculus domain-specific membrane glycoprotein Cd26 DPP4_RAT Dipeptidyl peptidase 4 Dipeptidyl peptidase 4 60 kDa soluble form Dipeptidyl peptidase 4 soluble form Dipeptidyl peptidase IV 60 kDa soluble form Dipeptidyl peptidase IV soluble form GP110 glycoprotein | T-cell activation antigen CD26
Type:
Enzyme
Mol. Mass.:
88084.94
Organism:
Rattus norvegicus (rat)
Description:
Residue:
767
  
Inhibitor
Name:
BDBM50388124
Synonyms:
CHEMBL2058967
Type:
Small organic molecule
Emp. Form.:
C19H25N5O2S
Mol. Mass.:
387.499
SMILES:
O=C([C@@H]1C[C@@H](CN1)N1CCN(CC1)c1nc2ccccc2o1)N1CCSC1
: