Target
Vitamin D3 receptor
Ligand
BDBM50388440
Substrate
Meas. Tech.
ChEMBL_829921 (CHEMBL2061569)
Ki
0.04±n/a nM
Citation
 Flores, ASicinski, RRGrzywacz, PThoden, JBPlum, LAClagett-Dame, MDeLuca, HF A 20S combined with a 22R configuration markedly increases both in vivo and in vitro biological activity of 1a,25-dihydroxy-22-methyl-2-methylene-19-norvitamin D3. J Med Chem 55:4352-66 (2012)  
Target
Name:
Vitamin D3 receptor
Synonyms:
Nr1i1 Vdr | Vitamin D receptor
Type:
PROTEIN
Mol. Mass.:
47811.07
Organism:
Rattus norvegicus
Description:
ChEMBL_1505946
Residue:
423
  
Inhibitor
Name:
BDBM50388440
Synonyms:
CHEMBL2059269
Type:
Small organic molecule
Emp. Form.:
C28H46O3
Mol. Mass.:
430.663
SMILES:
[#6]-[#6@H](-[#6]-[#6]C([#6])([#6])[#8])-[#6@H](-[#6])-[#6@H]1-[#6]-[#6]-[#6@H]2\[#6](-[#6]-[#6]-[#6][C@]12[#6])=[#6]\[#6]=[#6]-1/[#6]-[#6@@H](-[#8])-[#6](=[#6])-[#6@H](-[#8])-[#6]-1
: