Target
Casein kinase II subunit alpha
Ligand
BDBM50388781
Substrate
Meas. Tech.
ChEMBL_830892 (CHEMBL2065441)
IC50
3100±n/a nM
Citation
 Dowling, JEChuaqui, CPontz, TWLyne, PDLarsen, NABlock, MHChen, HSu, NWu, ARussell, DPollard, HLee, JWPeng, BThakur, KYe, QZhang, TBrassil, PRacicot, VBao, LDenz, CRCooke, E Potent and Selective Inhibitors of CK2 Kinase Identified through Structure-Guided Hybridization. ACS Med Chem Lett 3:278-283 (2012)  
Target
Name:
Casein kinase II subunit alpha
Synonyms:
CK II CK2- alpha CSK21_HUMAN Casein kinase 2 Casein kinase II alpha/beta Casein kinase II subunit alpha (CK2A1) Casein kinase II subunit alpha (CK2a V66A) Casein kinase II subunit alpha (CK2a)
Type:
Enzyme
Mol. Mass.:
45151.12
Organism:
Homo sapiens (Human)
Description:
P68400
Residue:
391
  
Inhibitor
Name:
BDBM50388781
Synonyms:
CHEMBL2062585
Type:
Small organic molecule
Emp. Form.:
C23H21N7O3
Mol. Mass.:
443.4579
SMILES:
CC(=O)Nc1ccc2n(CCC(O)=O)cc(-c3cc(NC4CC4)n4ncc(C#N)c4n3)c2c1
: