Target
Matrix metalloproteinase-9
Ligand
BDBM50389100
Substrate
Meas. Tech.
ChEMBL_832927 (CHEMBL2066798)
IC50
0.03±n/a nM
Citation
 Hugenberg, VBreyholz, HJRiemann, BHermann, SSchober, OSchäfers, MGangadharmath, UMocharla, VKolb, HWalsh, JZhang, WKopka, KWagner, S A new class of highly potent matrix metalloproteinase inhibitors based on triazole-substituted hydroxamates: (radio)synthesis and in vitro and first in vivo evaluation. J Med Chem 55:4714-27 (2012)  
Target
Name:
Matrix metalloproteinase-9
Synonyms:
67 kDa matrix metalloproteinase-9 92 kDa gelatinase CLG4B Gelatinase B MMP9 Matrix metalloproteinase 9 (MMP-9) Matrix metalloproteinase-9 (MMP9)
Type:
Enzyme
Mol. Mass.:
78452.28
Organism:
Homo sapiens (Human)
Description:
P14780
Residue:
707
  
Inhibitor
Name:
BDBM50389100
Synonyms:
CHEMBL2064547
Type:
Small organic molecule
Emp. Form.:
C17H24FN5O5S
Mol. Mass.:
429.466
SMILES:
COc1ccc(cc1)S(=O)(=O)N(Cc1cn(CCF)nn1)[C@H](C(C)C)C(=O)NO
: