Target
Serine/threonine-protein kinase PAK 4
Ligand
BDBM50389112
Substrate
Meas. Tech.
ChEMBL_832968 (CHEMBL2066923)
Ki
2.8±n/a nM
Citation
 Guo, CMcAlpine, IZhang, JKnighton, DDKephart, SJohnson, MCLi, HBouzida, DYang, ADong, LMarakovits, JTikhe, JRichardson, PGuo, LCKania, REdwards, MPKraynov, EChristensen, JPiraino, JLee, JDagostino, EDel-Carmen, CDeng, YLSmeal, TMurray, BW Discovery of pyrroloaminopyrazoles as novel PAK inhibitors. J Med Chem 55:4728-39 (2012)  
Target
Name:
Serine/threonine-protein kinase PAK 4
Synonyms:
KIAA1142 PAK4_HUMAN | p21-Activated kinase 4 (PAK4)
Type:
Protein
Mol. Mass.:
64098.01
Organism:
Homo sapiens (Human)
Description:
O96013
Residue:
591
  
Inhibitor
Name:
BDBM50389112
Synonyms:
CHEMBL2064556
Type:
Small organic molecule
Emp. Form.:
C37H34N8O
Mol. Mass.:
606.7189
SMILES:
CN(C)C[C@@H](NC(=O)c1ccc2[nH]nc(-c3nc4ccc(NCc5ccc(cc5)-c5ccccn5)cc4[nH]3)c2c1)c1ccccc1
: