Target
Serine/threonine-protein kinase mTOR
Ligand
BDBM50389280
Substrate
Meas. Tech.
ChEMBL_831689 (CHEMBL2065052)
Ki
7±n/a nM
Citation
 Liu, KKBailey, SDinh, DMLam, HLi, CWells, PAYin, MJZou, A Conformationally-restricted cyclic sulfones as potent and selective mTOR kinase inhibitors. Bioorg Med Chem Lett 22:5114-7 (2012)  
Target
Name:
Serine/threonine-protein kinase mTOR
Synonyms:
FK506-binding protein 12-rapamycin complex-associated protein 1 FRAP FRAP1 MTOR Mammalian Target of Rapamycin (mTOR) RAFT1 Rapamycin and FKBP12 target 1 Serine/threonine-protein kinase (mTOR) | mTORC2
Type:
Rapamycin target protein
Mol. Mass.:
288917.12
Organism:
Homo sapiens (Human)
Description:
P42345
Residue:
2549
  
Inhibitor
Name:
BDBM50389280
Synonyms:
CHEMBL2063760
Type:
Small organic molecule
Emp. Form.:
C21H25N5O4S
Mol. Mass.:
443.519
SMILES:
CCNC(=O)Nc1ccc(cc1)-c1nc2CS(=O)(=O)Cc2c(n1)N1C[C@@H]2CC[C@H](C1)O2
: