Target
Aurora kinase B
Ligand
BDBM50389993
Substrate
Meas. Tech.
ChEMBL_835007 (CHEMBL2073499)
IC50
26±n/a nM
Citation
 Curtin, MLHeyman, HRFrey, RRMarcotte, PAGlaser, KBJankowski, JRMagoc, TJAlbert, DHOlson, AMReuter, DRBouska, JJMontgomery, DAPalma, JPDonawho, CKStewart, KDTse, CMichaelides, MR Pyrazole diaminopyrimidines as dual inhibitors of KDR and Aurora B kinases. Bioorg Med Chem Lett 22:4750-5 (2012)  
Target
Name:
Aurora kinase B
Synonyms:
AIK2 AIM1 ARK2 AURKB_HUMAN Aurora B-INCENP Aurora kinase B (AURKB) STK-1 STK12 Serine/threonine-protein kinase aurora B
Type:
Protein
Mol. Mass.:
39327.72
Organism:
Homo sapiens (Human)
Description:
Q96GD4
Residue:
344
  
Inhibitor
Name:
BDBM50389993
Synonyms:
CHEMBL2071273
Type:
Small organic molecule
Emp. Form.:
C18H21ClN8O2
Mol. Mass.:
416.865
SMILES:
CNC(=O)Cn1cc(Nc2ncc(Cl)c(N[C@@H]3[C@@H]4C[C@@H](C=C4)[C@@H]3C(N)=O)n2)cn1
: