Target
Phosphatidylinositol 4,5-bisphosphate 3-kinase catalytic subunit delta isoform
Ligand
BDBM50390424
Substrate
Meas. Tech.
ChEMBL_834231 (CHEMBL2072998)
Ki
3±n/a nM
Citation
 Bruce, IAkhlaq, MBloomfield, GCBudd, ECox, BCuenoud, BFinan, PGedeck, PHatto, JHayler, JFHead, DKeller, TKirman, LLeblanc, CLe Grand, DMcCarthy, CO'Connor, DOwen, COza, MSPilgrim, GPress, NESviridenko, LWhitehead, L Development of isoform selective PI3-kinase inhibitors as pharmacological tools for elucidating the PI3K pathway. Bioorg Med Chem Lett 22:5445-50 (2012)  
Target
Name:
Phosphatidylinositol 4,5-bisphosphate 3-kinase catalytic subunit delta isoform
Synonyms:
PI3-kinase p110 subunit delta PI3-kinase subunit p110-delta PIK3CD Phosphatidylinositol 4,5-biphosphate 3-kinase catalytic subunit delta (PIK3CD) Phosphatidylinositol 4,5-bisphosphate 3-kinase 110 kDa catalytic subunit delta (PI3K delta) Phosphatidylinositol 4,5-bisphosphate 3-kinase catalytic subunit delta (PI3Kdelta) Phosphatidylinositol 4,5-bisphosphate 3-kinase catalytic subunit delta isoform (PI3K delta) Phosphatidylinositol 4,5-bisphosphate 3-kinase catalytic subunit delta isoform (PI3K-delta) Phosphatidylinositol 4,5-bisphosphate 3-kinase catalytic subunit delta isoform (PI3Kdelta)
Type:
Enzyme Subunit
Mol. Mass.:
119489.41
Organism:
Homo sapiens (Human)
Description:
O00329
Residue:
1044
  
Inhibitor
Name:
BDBM50390424
Synonyms:
CHEMBL2071340
Type:
Small organic molecule
Emp. Form.:
C19H20FN5O5S2
Mol. Mass.:
481.521
SMILES:
Cc1cc(NC(=O)CCNC(=O)Nc2nc(C)c(s2)-c2ccc(c(F)c2)S(C)(=O)=O)no1
: