Target
Casein kinase I isoform delta
Ligand
BDBM50390496
Substrate
Meas. Tech.
ChEMBL_835302 (CHEMBL2072008)
IC50
1630±n/a nM
Citation
 Hua, ZHuang, XBregman, HChakka, NDiMauro, EFDoherty, EMGoldstein, JGunaydin, HHuang, HMercede, SNewcomb, JPatel, VFTurci, SMYan, JWilson, CMartin, MW 2-Phenylamino-6-cyano-1H-benzimidazole-based isoform selective casein kinase 1 gamma (CK1¿) inhibitors. Bioorg Med Chem Lett 22:5392-5 (2012)  
Target
Name:
Casein kinase I isoform delta
Synonyms:
CKI-delta CSNK1D Casein kinase I delta Casein kinase I isoform delta (CK1D) KC1D_HUMAN | casein kinases 1 delta (CK1 delta)
Type:
Enzyme
Mol. Mass.:
47356.76
Organism:
Homo sapiens (Human)
Description:
P48730
Residue:
415
  
Inhibitor
Name:
BDBM50390496
Synonyms:
CHEMBL2071610
Type:
Small organic molecule
Emp. Form.:
C19H12FN5
Mol. Mass.:
329.3305
SMILES:
Fc1ncccc1-c1ccc(Nc2nc3ccc(cc3[nH]2)C#N)cc1
: