Target
Carbonic anhydrase 1
Ligand
BDBM50390678
Substrate
Meas. Tech.
ChEMBL_835654 (CHEMBL2071765)
Ki
7500±n/a nM
Citation
 Sechi, MInnocenti, APala, NRogolino, DCarcelli, MScozzafava, ASupuran, CT Inhibition ofa-class cytosolic human carbonic anhydrases I, II, IX and XII, andß-class fungal enzymes by carboxylic acids and their derivatives: new isoform-I selective nanomolar inhibitors. Bioorg Med Chem Lett 22:5801-6 (2012)  
Target
Name:
Carbonic anhydrase 1
Synonyms:
CA-I CAB Carbonate dehydratase I Carbonic anhydrase 1 (CA I) Carbonic anhydrase 1 (Recombinant CA I) Carbonic anhydrase B Carbonic anhydrase I (CA I) Carbonic anhydrase I (CAI) Carbonic anhydrase isoenzyme I (hCA I) | hCA
Type:
Enzyme
Mol. Mass.:
28873.37
Organism:
Homo sapiens (Human)
Description:
P00915
Residue:
261
  
Inhibitor
Name:
BDBM50390678
Synonyms:
CHEMBL2070204
Type:
Small organic molecule
Emp. Form.:
C13H11NO5
Mol. Mass.:
261.2301
SMILES:
CC(=O)c1c(C(O)=O)n(C)c2cc3OCOc3cc12
: