Target
Lysine-specific demethylase 4C
Ligand
BDBM26113
Substrate
Meas. Tech.
ChEMBL_835846 (CHEMBL2071957)
Ki
13000±n/a nM
Citation
 Leurs, UClausen, RPKristensen, JLLohse, B Inhibitor scaffold for the histone lysine demethylase KDM4C (JMJD2C). Bioorg Med Chem Lett 22:5811-3 (2012)  
Target
Name:
Lysine-specific demethylase 4C
Synonyms:
GASC-1 protein Gene amplified in squamous cell carcinoma 1 protein JMJD2C Jumonji domain-containing protein 2C KDM4C_HUMAN | KIAA0780
Type:
Protein
Mol. Mass.:
119979.01
Organism:
Homo sapiens (Human)
Description:
Q9H3R0
Residue:
1056
  
Inhibitor
Name:
BDBM26113
Synonyms:
2,4 PDCA pyridine carboxylate, 6a | pyridine-2,4-dicarboxylic acid
Type:
Small organic molecule
Emp. Form.:
C7H5NO4
Mol. Mass.:
167.1189
SMILES:
OC(=O)c1ccnc(c1)C(O)=O
: