Target
Inward rectifier potassium channel 2
Ligand
BDBM50391770
Substrate
Meas. Tech.
ChEMBL_849883 (CHEMBL2148627)
IC50
>100000±n/a nM
Citation
 Tang, HWalsh, SPYan, Yde Jesus, RKShahripour, ATeumelsan, NZhu, YHa, SOwens, KAThomas-Fowlkes, BSFelix, JPLiu, JKohler, MPriest, BTBailey, TBrochu, RAlonso-Galicia, MKaczorowski, GJRoy, SYang, LMills, SGGarcia, MLPasternak, A Discovery of Selective Small Molecule ROMK Inhibitors as Potential New Mechanism Diuretics. ACS Med Chem Lett 3:367-372 (2012)  
Target
Name:
Inward rectifier potassium channel 2
Synonyms:
Cardiac inward rectifier potassium channel IRK1 KCNJ2 Potassium channel, inwardly rectifying subfamily J member 2 | hIRK1
Type:
PROTEIN
Mol. Mass.:
48281.20
Organism:
Homo sapiens (Human)
Description:
ChEMBL_1515520
Residue:
427
  
Inhibitor
Name:
BDBM50391770
Synonyms:
CHEMBL2146755 | US9073882, 1
Type:
Small organic molecule
Emp. Form.:
C20H24N4O4
Mol. Mass.:
384.429
SMILES:
[O-][N+](=O)c1ccc(CCN2CCN(CCc3ccc(cc3)[N+]([O-])=O)CC2)cc1
: