Target
Hydroxycarboxylic acid receptor 1
Ligand
BDBM50336491
Substrate
Meas. Tech.
ChEMBL_850283 (CHEMBL2150703)
EC50
184000±n/a nM
Citation
 Dvorak, CALiu, CShelton, JKuei, CSutton, SWLovenberg, TWCarruthers, NI Identification of Hydroxybenzoic Acids as Selective Lactate Receptor (GPR81) Agonists with Antilipolytic Effects. ACS Med Chem Lett 3:637-639 (2012)  
Target
Name:
Hydroxycarboxylic acid receptor 1
Synonyms:
G-protein coupled receptor 104 GPR81 HCAR1 | HCAR1_HUMAN
Type:
PROTEIN
Mol. Mass.:
39313.04
Organism:
Homo sapiens (Human)
Description:
ChEMBL_850283
Residue:
346
  
Inhibitor
Name:
BDBM50336491
Synonyms:
3-Hydroxy-benzoic acid 3-Hydroxybenzoate, II CHEMBL65369
Type:
Small organic molecule
Emp. Form.:
C7H6O3
Mol. Mass.:
138.1207
SMILES:
OC(=O)c1cccc(O)c1
: