Target
Hydroxycarboxylic acid receptor 1
Ligand
BDBM50391825
Substrate
Meas. Tech.
ChEMBL_850289 (CHEMBL2150709)
EC50
22000±n/a nM
Citation
 Dvorak, CALiu, CShelton, JKuei, CSutton, SWLovenberg, TWCarruthers, NI Identification of Hydroxybenzoic Acids as Selective Lactate Receptor (GPR81) Agonists with Antilipolytic Effects. ACS Med Chem Lett 3:637-639 (2012)  
Target
Name:
Hydroxycarboxylic acid receptor 1
Synonyms:
Gpr81 Hcar1
Type:
PROTEIN
Mol. Mass.:
38945.31
Organism:
Mus musculus
Description:
ChEMBL_850289
Residue:
343
  
Inhibitor
Name:
BDBM50391825
Synonyms:
CHEMBL2146910
Type:
Small organic molecule
Emp. Form.:
C7H5ClO3
Mol. Mass.:
172.566
SMILES:
OC(=O)c1cc(O)cc(Cl)c1
: