Target
Cholinesterase
Ligand
BDBM50391931
Substrate
Meas. Tech.
ChEMBL_849932 (CHEMBL2148782)
IC50
50.1±n/a nM
Citation
 Kortylewicz, ZPKimura, YInoue, KMack, EBaranowska-Kortylewicz, J Radiolabeled cyclosaligenyl monophosphates of 5-iodo-2'-deoxyuridine, 5-iodo-3'-fluoro-2',3'-dideoxyuridine, and 3'-fluorothymidine for molecular radiotherapy of cancer: synthesis and biological evaluation. J Med Chem 55:2649-71 (2012)  
Target
Name:
Cholinesterase
Synonyms:
Acylcholine acylhydrolase Butyrylcholine esterase (BChE) Butyrylcholinesterase (BuChE) CHLE_HUMAN Cholinesterases Pseudocholinesterase
Type:
Homotetramer
Mol. Mass.:
68422.27
Organism:
Homo sapiens (Human)
Description:
P06276
Residue:
602
  
Inhibitor
Name:
BDBM50391931
Synonyms:
CHEMBL2147632
Type:
Small organic molecule
Emp. Form.:
C24H31FIN2O8P
Mol. Mass.:
652.3882
SMILES:
CC(C)(C)c1cc(c2OP(=O)(OC[C@H]3O[C@H](C[C@@H]3O)n3cc(I)c(=O)[nH]c3=O)OCc2c1F)C(C)(C)C
: