Target
Cholinesterase
Ligand
BDBM50391933
Substrate
Meas. Tech.
ChEMBL_849932 (CHEMBL2148782)
IC50
61.2±n/a nM
Citation
 Kortylewicz, ZPKimura, YInoue, KMack, EBaranowska-Kortylewicz, J Radiolabeled cyclosaligenyl monophosphates of 5-iodo-2'-deoxyuridine, 5-iodo-3'-fluoro-2',3'-dideoxyuridine, and 3'-fluorothymidine for molecular radiotherapy of cancer: synthesis and biological evaluation. J Med Chem 55:2649-71 (2012)  
Target
Name:
Cholinesterase
Synonyms:
Acylcholine acylhydrolase Butyrylcholine esterase (BChE) Butyrylcholinesterase (BuChE) CHLE_HUMAN Cholinesterases Pseudocholinesterase
Type:
Homotetramer
Mol. Mass.:
68422.27
Organism:
Homo sapiens (Human)
Description:
P06276
Residue:
602
  
Inhibitor
Name:
BDBM50391933
Synonyms:
CHEMBL2147631
Type:
Small organic molecule
Emp. Form.:
C17H18IN2O8P
Mol. Mass.:
536.2117
SMILES:
Cc1cccc2COP(=O)(OC[C@H]3O[C@H](C[C@@H]3O)n3cc(I)c(=O)[nH]c3=O)Oc12
: