Target
D(2) dopamine receptor
Ligand
BDBM50115277
Substrate
Meas. Tech.
ChEMBL_851588 (CHEMBL2157073)
Ki
59±n/a nM
Citation
 Johnson, MAntonio, TReith, MEDutta, AK Structure-activity relationship study of N6-(2-(4-(1H-Indol-5-yl)piperazin-1-yl)ethyl)-N6-propyl-4,5,6,7-tetrahydrobenzo[d]thiazole-2,6-diamine analogues: development of highly selective D3 dopamine receptor agonists along with a highly potent D2/D3 agonist and their pharmacological characterizatio J Med Chem 55:5826-40 (2012)  
Target
Name:
D(2) dopamine receptor
Synonyms:
DOPAMINE D2 DOPAMINE D2 Short Dopamine D2 receptor Drd2
Type:
G Protein-Coupled Receptor (GPCR)
Mol. Mass.:
50931.60
Organism:
Rattus norvegicus (rat)
Description:
P61169
Residue:
444
  
Inhibitor
Name:
BDBM50115277
Synonyms:
(2R,3R)-6-Dipropylamino-5,6,7,8-tetrahydro-naphthalen-1-ol (2S)-6-Dipropylamino-5,6,7,8-tetrahydro-naphthalen-1-ol (S)-(-)-5-hydroxy-2-(N,N-di-n-propylamino)tetralin (S)-6-Dipropylamino-5,6,7,8-tetrahydro-naphthalen-1-ol.HCl CHEMBL269004
Type:
Small organic molecule
Emp. Form.:
C16H25NO
Mol. Mass.:
247.3758
SMILES:
CCCN(CCC)[C@H]1CCc2c(O)cccc2C1
: