Target
D(2) dopamine receptor
Ligand
BDBM50392123
Substrate
Meas. Tech.
ChEMBL_851588 (CHEMBL2157073)
Ki
134±n/a nM
Citation
 Johnson, MAntonio, TReith, MEDutta, AK Structure-activity relationship study of N6-(2-(4-(1H-Indol-5-yl)piperazin-1-yl)ethyl)-N6-propyl-4,5,6,7-tetrahydrobenzo[d]thiazole-2,6-diamine analogues: development of highly selective D3 dopamine receptor agonists along with a highly potent D2/D3 agonist and their pharmacological characterizatio J Med Chem 55:5826-40 (2012)  
Target
Name:
D(2) dopamine receptor
Synonyms:
DOPAMINE D2 DOPAMINE D2 Short Dopamine D2 receptor Drd2
Type:
G Protein-Coupled Receptor (GPCR)
Mol. Mass.:
50931.60
Organism:
Rattus norvegicus (rat)
Description:
P61169
Residue:
444
  
Inhibitor
Name:
BDBM50392123
Synonyms:
CHEMBL2152634 | US10874669, Compound (-)-10
Type:
Small organic molecule
Emp. Form.:
C24H34N6S
Mol. Mass.:
438.632
SMILES:
CCCN(CCN1CCN(CC1)c1ccc2[nH]ccc2c1)[C@@H]1CCc2nc(N)sc2C1
: