Target
Cannabinoid receptor 1
Ligand
BDBM29094
Substrate
Meas. Tech.
ChEMBL_851501 (CHEMBL2156617)
IC50
139±n/a nM
Citation
 Chorvat, RJBerbaum, JSeriacki, KMcElroy, JF JD-5006 and JD-5037: peripherally restricted (PR) cannabinoid-1 receptor blockers related to SLV-319 (Ibipinabant) as metabolic disorder therapeutics devoid of CNS liabilities. Bioorg Med Chem Lett 22:6173-80 (2012)  
Target
Name:
Cannabinoid receptor 1
Synonyms:
CANN6 CB-R CNR CNR1_HUMAN Cannabinoid receptor Cannabinoid receptor 1 (brain)
Type:
G Protein-Coupled Receptor (GPCR)
Mol. Mass.:
52868.96
Organism:
Homo sapiens (Human)
Description:
P21554
Residue:
472
  
Inhibitor
Name:
BDBM29094
Synonyms:
(+/-)-SLV319 3-(4-chlorophenyl)-N''''-(4-chlorophenylsulfonyl)-N-methyl-4-phenyl-4,5-dihydro-1H-pyrazole-1-carboximidamide CHEMBL158784 ibipinabant
Type:
Small organic molecule
Emp. Form.:
C23H20Cl2N4O2S
Mol. Mass.:
487.402
SMILES:
CN=C(NS(=O)(=O)c1ccc(Cl)cc1)N1CC(C(=N1)c1ccc(Cl)cc1)c1ccccc1
: