Target
Phosphorylase b kinase gamma catalytic chain, liver/testis isoform
Ligand
BDBM50392791
Substrate
Meas. Tech.
ChEMBL_853158 (CHEMBL2154707)
IC50
6.1±n/a nM
Citation
 Wang, TLamb, MLBlock, MHDavies, AMHan, YHoffmann, EIoannidis, SJosey, JALiu, ZYLyne, PDMacIntyre, TMohr, PJOmer, CASjögren, TThress, KWang, BWang, HYu, DZhang, HJ Discovery of Disubstituted Imidazo[4,5-b]pyridines and Purines as Potent TrkA Inhibitors. ACS Med Chem Lett 3:705-709 (2012)  
Target
Name:
Phosphorylase b kinase gamma catalytic chain, liver/testis isoform
Synonyms:
PHKG2 Phosphorylase kinase | Phosphorylase kinase gamma subunit 2
Type:
PROTEIN
Mol. Mass.:
46440.15
Organism:
Homo sapiens (Human)
Description:
ChEMBL_774277
Residue:
406
  
Inhibitor
Name:
BDBM50392791
Synonyms:
CHEMBL2151321 | US8486966, 1
Type:
Small organic molecule
Emp. Form.:
C19H20FN7O
Mol. Mass.:
381.4068
SMILES:
CC(C)Oc1cc(n[nH]1)-n1cnc2ccc(N[C@@H](C)c3ccc(F)cn3)nc12
: