Target
Free fatty acid receptor 1
Ligand
BDBM50392863
Substrate
Meas. Tech.
ChEMBL_853334 (CHEMBL2155124)
EC50
38000±n/a nM
Citation
 Brown, SPDransfield, PJVimolratana, MJiao, XZhu, LPattaropong, VSun, YLiu, JLuo, JZhang, JWong, SZhuang, RGuo, QLi, FMedina, JCSwaminath, GLin, DCHouze, JB Discovery of AM-1638: A Potent and Orally Bioavailable GPR40/FFA1 Full Agonist. ACS Med Chem Lett 3:726-730 (2012)  
Target
Name:
Free fatty acid receptor 1
Synonyms:
FFAR1 G-protein Coupled Receptor 40 | GPR40
Type:
G Protein-Coupled Receptor (GPCR)
Mol. Mass.:
31473.32
Organism:
Homo sapiens (Human)
Description:
O14842
Residue:
300
  
Inhibitor
Name:
BDBM50392863
Synonyms:
CHEMBL2152069
Type:
Small organic molecule
Emp. Form.:
C26H25FO4
Mol. Mass.:
420.4727
SMILES:
COc1ccc(F)c(c1)-c1ccc(COc2cccc(c2)[C@@H](CC(O)=O)C2CC2)cc1
: