Target
Acetylcholinesterase
Ligand
BDBM50392998
Substrate
Meas. Tech.
ChEMBL_853571 (CHEMBL2153989)
Ki
1120±n/a nM
Citation
 Darras, FHKling, BHeilmann, JDecker, M Neuroprotective Tri- and Tetracyclic BChE Inhibitors Releasing Reversible Inhibitors upon Carbamate Transfer. ACS Med Chem Lett 3:914-919 (2012)  
Target
Name:
Acetylcholinesterase
Synonyms:
ACES_ELEEL Acetylcholinesterase (EeAChE) | ache
Type:
Enzyme
Mol. Mass.:
71812.79
Organism:
Electrophorus electricus (Electric eel)
Description:
Residue:
633
  
Inhibitor
Name:
BDBM50392998
Synonyms:
CHEMBL2152544
Type:
Small organic molecule
Emp. Form.:
C21H25N3O2
Mol. Mass.:
351.4421
SMILES:
CCN(C)C(=O)Oc1ccc2N(C)C3N(CCc4ccccc34)Cc2c1
: