Target
Tyrosine-protein phosphatase non-receptor type 22
Ligand
BDBM50393477
Substrate
Meas. Tech.
ChEMBL_855963 (CHEMBL2161837)
IC50
>40000±n/a nM
Citation
 Stanford, SMKrishnamurthy, DFalk, MDMessina, RDebnath, BLi, SLiu, TKazemi, RDahl, RHe, YYu, XChan, ACZhang, ZYBarrios, AMWoods, VLNeamati, NBottini, N Discovery of a novel series of inhibitors of lymphoid tyrosine phosphatase with activity in human T cells. J Med Chem 54:1640-54 (2011)  
Target
Name:
Tyrosine-protein phosphatase non-receptor type 22
Synonyms:
3.1.3.48 LyP Lymphoid phosphatase (Lyp) PEST-domain phosphatase PTPN22 Tyrosine-protein phosphatase non-receptor type 22 (LYP) | tyrosine-protein phosphatase non-receptor type 22 isoform 1
Type:
Mol. Mass.:
91712.31
Organism:
Homo sapiens (Human)
Description:
Q9Y2R2
Residue:
807
  
Inhibitor
Name:
BDBM50393477
Synonyms:
CHEMBL2159953
Type:
Small organic molecule
Emp. Form.:
C27H37N7O
Mol. Mass.:
475.629
SMILES:
Cc1ccc2[nH]c(=O)c(cc2c1)C(N1CCN(CC1)C1CCCCC1)c1nnnn1C1CCCC1
: